Re: [cc65] sizeof error

From: <>
Date: 2012-04-22 23:24:58
On 2012-04-22, at 23:16, Ullrich von Bassewitz wrote:

>> I am not sure if it is related or I just hit the "inbetween" revision on the
>> SVN but what I checked out tonight says:
> Hmm, that's weird. I cannot reproduce the problem here, but one of the
> intermediate versions (that was never checked in) produced similar errors.
> Could you please do "make zap" in all directories, "svn update" and rebuild?
> If the error persists, please let me know.

It was a freshly checked out working copy. I did a fresh checkout for the very reason. Here is the next try:

Zarathustra:cc65 silverdr$ make -f make/gcc.mak zap

Zarathustra:cc65 silverdr$ svu
At revision 5649.

Zarathustra:cc65 silverdr$ make -f make/gcc.mak
asctime.c(49): Error: Variable `buf' has unknown size
make[3]: *** [asctime.o] Error 1
make[2]: *** [apple2lib] Error 1
make[1]: *** [all] Error 1
make: *** [libs] Error 2

We are talking about the "trunk" version, right? As per: 

Zarathustra:cc65 silverdr$ svn info
Path: .
URL: svn://
Repository Root: svn://
Repository UUID: b7a2c559-68d2-44c3-8de9-860c34a00d81
Revision: 5649
Node Kind: directory
Schedule: normal
Last Changed Author: uz
Last Changed Rev: 5649
Last Changed Date: 2012-04-22 20:09:17 +0200 (Sun, 22 Apr 2012)

To unsubscribe from the list send mail to with
the string "unsubscribe cc65" in the body(!) of the mail.
Received on Sun Apr 22 23:25:08 2012

This archive was generated by hypermail 2.1.8 : 2012-04-22 23:25:12 CEST